periodic-tripleo-ci-centos-7-ovb-3ctlr_1comp-featureset001-queens

periodic-tripleo-ci-centos-7-ovb-3ctlr_1comp-featureset001-queens

Date Length Reason Logs Logstash Pipeline
| 2019-05-25 06:58 | | 6954.0 min | | SUCCESS | | Logs | | - | | openstack-periodic-24hr |
| 2019-05-24 06:54 | | 6852.0 min | | SUCCESS | | Logs | | - | | openstack-periodic-24hr |

periodic-tripleo-ci-centos-7-ovb-3ctlr_1comp_1supp-featureset039-queens

periodic-tripleo-ci-centos-7-ovb-3ctlr_1comp_1supp-featureset039-queens

Date Length Reason Logs Logstash Pipeline
| 2019-05-25 06:50 | | 6498.0 min | | Please investigate. Overcloud stack: FAILED. | | Logs | | Logstash | | openstack-periodic-24hr |
| 2019-05-24 06:58 | | 7057.0 min | | Please investigate. Overcloud stack: FAILED. | | Logs | | Logstash | | openstack-periodic-24hr |

periodic-tripleo-centos-7-pike-containers-build

periodic-tripleo-centos-7-pike-containers-build

Date Length Reason Logs Logstash Pipeline
| 2019-05-25 04:53 | | 2993.0 min | | SUCCESS | | Logs | | - | | openstack-periodic-24hr |
| 2019-05-24 04:57 | | 3313.0 min | | SUCCESS | | Logs | | - | | openstack-periodic-24hr |
| 2019-05-23 05:03 | | 3426.0 min | | SUCCESS | | Logs | | - | | openstack-periodic-24hr |

periodic-tripleo-ci-centos-7-multinode-1ctlr-featureset030-rocky

periodic-tripleo-ci-centos-7-multinode-1ctlr-featureset030-rocky

Date Length Reason Logs Logstash Pipeline
| 2019-05-25 05:51 | | 4430.0 min | | SUCCESS | | Logs | | - | | openstack-periodic-24hr |
| 2019-05-24 06:05 | | 5190.0 min | | SUCCESS | | Logs | | - | | openstack-periodic-24hr |

tripleo-ci-centos-7-standalone-rocky

tripleo-ci-centos-7-standalone-rocky

Date Length Reason Patch Logs Branch Logstash Pipeline
| 2019-05-24 22:51 | | 112 min | | SUCCESS | | 656797,3 ? | | Logs | | stable/rocky | | - | | check |
| 2019-05-23 23:33 | | 98 min | | SUCCESS | | 661103,1 ? | | Logs | | stable/rocky | | - | | check |
| 2019-05-23 23:33 | | 94 min | | SUCCESS | | 661110,1 ? | | Logs | | stable/rocky | | - | | check |
| 2019-05-23 20:32 | | 99 min | | SUCCESS | | 661035,1 ? | | Logs | | stable/rocky | | - | | check |
| 2019-05-23 19:47 | | 100 min | | SUCCESS | | 661029,1 ? | | Logs | | stable/rocky | | - | | check |
| 2019-05-23 17:37 | | 104 min | | SUCCESS | | 660764,3 ? | | Logs | | stable/rocky | | - | | check |
| 2019-05-23 16:33 | | 100 min | | SUCCESS | | 660997,2 ? | | Logs | | stable/rocky | | - | | check |
| 2019-05-23 12:06 | | 95 min | | SUCCESS | | 660943,1 ? | | Logs | | stable/rocky | | - | | check |
| 2019-05-23 11:49 | | 87 min | | SUCCESS | | 660938,1 ? | | Logs | | stable/rocky | | - | | check |
| 2019-05-23 05:03 | | 89 min | | SUCCESS | | 660849,1 ? | | Logs | | stable/rocky | | - | | check |
| 2019-05-23 02:37 | | 98 min | | SUCCESS | | 660764,2 ? | | Logs | | stable/rocky | | - | | check |
| 2019-05-22 11:23 | | 99 min | | SUCCESS | | 634382,5 ? | | Logs | | stable/rocky | | - | | check |
| 2019-05-21 20:14 | | 107 min | | SUCCESS | | 658280,3 ? | | Logs | | stable/rocky | | - | | check |
| 2019-05-21 16:47 | | 102 min | | SUCCESS | | 660377,1 ? | | Logs | | stable/rocky | | - | | check |
| 2019-05-21 13:47 | | 23 min | | Delorean FAIL. | | 658280,1 ? | | Logs | | stable/rocky | | Logstash | | check |
| 2019-05-20 22:26 | | 100 min | | SUCCESS | | 656416,4 ? | | Logs | | stable/rocky | | - | | check |
| 2019-05-20 16:52 | | 101 min | | SUCCESS | | 653838,6 ? | | Logs | | master | | - | | check |
| 2019-05-20 16:34 | | 116 min | | SUCCESS | | 653843,6 ? | | Logs | | master | | - | | check |
| 2019-05-20 15:49 | | 17 min | | Please investigate. Reason was NOT FOUND. | | 659906,6 ? | | Logs | | master | | - | | check |
| 2019-05-20 15:49 | | 17 min | | Please investigate. Reason was NOT FOUND. | | 659906,6 ? | | Logs | | master | | - | | check |
| 2019-05-20 15:34 | | 85 min | | SUCCESS | | 659794,2 ? | | Logs | | master | | - | | check |
| 2019-05-20 15:08 | | 96 min | | SUCCESS | | 659909,6 ? | | Logs | | master | | - | | check |
| 2019-05-20 14:59 | | 96 min | | SUCCESS | | 643056,12 ? | | Logs | | master | | - | | check |
| 2019-05-20 14:57 | | 103 min | | SUCCESS | | 660100,1 ? | | Logs | | master | | - | | check |
| 2019-05-20 14:21 | | 86 min | | SUCCESS | | 659238,3 ? | | Logs | | master | | - | | check |
| 2019-05-20 12:31 | | 107 min | | SUCCESS | | 660036,2 ? | | Logs | | master | | - | | check |
| 2019-05-20 11:31 | | 92 min | | SUCCESS | | 660060,3 ? | | Logs | | master | | - | | check |
| 2019-05-20 11:31 | | 92 min | | SUCCESS | | 660060,3 ? | | Logs | | master | | - | | check |
| 2019-05-20 09:06 | | 10 min | | Pip install FAIL. | | 653934,4 ? | | Logs | | master | | Logstash | | check |
| 2019-05-20 07:52 | | 11 min | | Pip install FAIL. | | 660036,1 ? | | Logs | | master | | Logstash | | check |
| 2019-05-20 02:15 | | 92 min | | SUCCESS | | 659907,6 ? | | Logs | | master | | - | | check |
| 2019-05-20 00:24 | | 18 min | | Please investigate. Reason was NOT FOUND. | | 659909,5 ? | | Logs | | master | | - | | check |
| 2019-05-19 23:55 | | 14 min | | Please investigate. Reason was NOT FOUND. | | 659906,4 ? | | Logs | | master | | - | | check |
| 2019-05-19 23:55 | | 14 min | | Please investigate. Reason was NOT FOUND. | | 659906,4 ? | | Logs | | master | | - | | check |
| 2019-05-19 22:10 | | 92 min | | SUCCESS | | 659907,4 ? | | Logs | | master | | - | | check |
| 2019-05-19 13:42 | | 93 min | | SUCCESS | | 659907,3 ? | | Logs | | master | | - | | check |
| 2019-05-19 13:14 | | 87 min | | SUCCESS | | 659909,3 ? | | Logs | | master | | - | | check |
| 2019-05-19 12:54 | | 89 min | | SUCCESS | | 659925,2 ? | | Logs | | master | | - | | check |
| 2019-05-19 11:40 | | 90 min | | SUCCESS | | 647467,11 ? | | Logs | | master | | - | | check |
| 2019-05-19 09:52 | | 96 min | | SUCCESS | | 659926,2 ? | | Logs | | master | | - | | check |
| 2019-05-19 09:14 | | 90 min | | SUCCESS | | 659925,2 ? | | Logs | | master | | - | | check |
| 2019-05-19 03:06 | | 91 min | | SUCCESS | | 659906,3 ? | | Logs | | master | | - | | check |
| 2019-05-19 03:06 | | 91 min | | SUCCESS | | 659906,3 ? | | Logs | | master | | - | | check |
| 2019-05-19 02:35 | | 80 min | | SUCCESS | | 659907,2 ? | | Logs | | master | | - | | check |

periodic-tripleo-ci-centos-7-multinode-1ctlr-featureset017-pike

periodic-tripleo-ci-centos-7-multinode-1ctlr-featureset017-pike

Date Length Reason Logs Logstash Pipeline
| 2019-05-25 06:27 | | 5567.0 min | | SUCCESS | | Logs | | - | | openstack-periodic-24hr |
| 2019-05-24 06:22 | | 5009.0 min | | SUCCESS | | Logs | | - | | openstack-periodic-24hr |
| 2019-05-23 06:30 | | 5028.0 min | | SUCCESS | | Logs | | - | | openstack-periodic-24hr |

tripleo-ci-centos-7-ovb-3ctlr_1comp-featureset001-rocky-branch

tripleo-ci-centos-7-ovb-3ctlr_1comp-featureset001-rocky-branch

Date Length Reason Patch Logs Branch Logstash Pipeline
| 2019-05-25 09:27 | | 117 min | | SUCCESS | | 661265,1 ? | | Logs | | master | | - | | check |
| 2019-05-24 22:04 | | 119 min | | SUCCESS | | 661137,1 ? | | Logs | | master | | - | | check |
| 2019-05-24 22:04 | | 119 min | | SUCCESS | | 661137,1 ? | | Logs | | master | | - | | check |
| 2019-05-24 17:39 | | 125 min | | SUCCESS | | 661330,2 ? | | Logs | | master | | - | | check |
| 2019-05-24 15:23 | | 123 min | | SUCCESS | | 659794,11 ? | | Logs | | master | | - | | check |
| 2019-05-24 14:58 | | 127 min | | SUCCESS | | 661265,1 ? | | Logs | | master | | - | | check |
| 2019-05-24 09:50 | | 122 min | | SUCCESS | | 656269,2 ? | | Logs | | master | | - | | check |
| 2019-05-24 09:32 | | 18 min | | Please investigate. Reason was NOT FOUND. | | 659906,10 ? | | Logs | | master | | - | | check |
| 2019-05-24 09:32 | | 18 min | | Please investigate. Reason was NOT FOUND. | | 659906,10 ? | | Logs | | master | | - | | check |
| 2019-05-24 09:07 | | 125 min | | SUCCESS | | 660922,2 ? | | Logs | | master | | - | | check |
| 2019-05-24 06:12 | | 120 min | | SUCCESS | | 660922,2 ? | | Logs | | master | | - | | check |
| 2019-05-24 03:25 | | 131 min | | SUCCESS | | 660922,2 ? | | Logs | | master | | - | | check |
| 2019-05-24 02:05 | | 125 min | | SUCCESS | | 661137,1 ? | | Logs | | master | | - | | check |
| 2019-05-24 02:05 | | 125 min | | SUCCESS | | 661137,1 ? | | Logs | | master | | - | | check |
| 2019-05-24 01:11 | | 120 min | | SUCCESS | | 659794,10 ? | | Logs | | master | | - | | check |
| 2019-05-23 22:52 | | 123 min | | SUCCESS | | 661109,1 ? | | Logs | | master | | - | | check |
| 2019-05-23 20:54 | | 169 min | | Please investigate. Overcloud stack: FAILED. | | 659794,9 ? | | Logs | | master | | Logstash | | check |
| 2019-05-23 20:53 | | 142 min | | SUCCESS | | 660922,2 ? | | Logs | | master | | - | | check |
| 2019-05-23 19:56 | | 124 min | | SUCCESS | | 661049,1 ? | | Logs | | master | | - | | check |
| 2019-05-23 19:09 | | 143 min | | SUCCESS | | 661034,1 ? | | Logs | | master | | - | | check |
| 2019-05-23 18:12 | | 129 min | | SUCCESS | | 660922,2 ? | | Logs | | master | | - | | check |
| 2019-05-23 17:26 | | 128 min | | SUCCESS | | 652971,8 ? | | Logs | | master | | - | | check |
| 2019-05-23 17:26 | | 128 min | | SUCCESS | | 652971,8 ? | | Logs | | master | | - | | check |
| 2019-05-23 16:18 | | 126 min | | SUCCESS | | 656398,12 ? | | Logs | | master | | - | | check |
| 2019-05-23 16:18 | | 126 min | | SUCCESS | | 656398,12 ? | | Logs | | master | | - | | check |
| 2019-05-23 16:08 | | 133 min | | SUCCESS | | 657959,7 ? | | Logs | | master | | - | | check |
| 2019-05-23 14:50 | | 126 min | | SUCCESS | | 660176,6 ? | | Logs | | master | | - | | check |
| 2019-05-23 10:45 | | 130 min | | SUCCESS | | 660922,1 ? | | Logs | | master | | - | | check |
| 2019-05-23 00:08 | | 120 min | | SUCCESS | | 659794,6 ? | | Logs | | master | | - | | check |
| 2019-05-22 21:59 | | 129 min | | SUCCESS | | 660508,5 ? | | Logs | | master | | - | | check |
| 2019-05-22 21:59 | | 129 min | | SUCCESS | | 660508,5 ? | | Logs | | master | | - | | check |
| 2019-05-22 16:25 | | 152 min | | SUCCESS | | 657959,6 ? | | Logs | | master | | - | | check |
| 2019-05-22 16:07 | | 120 min | | SUCCESS | | 660710,2 ? | | Logs | | master | | - | | check |
| 2019-05-22 16:07 | | 120 min | | SUCCESS | | 660710,2 ? | | Logs | | master | | - | | check |
| 2019-05-22 16:00 | | 221 min | | Job timeout. | | 660354,2 ? | | Logs | | master | | Logstash | | check |
| 2019-05-22 13:26 | | 138 min | | SUCCESS | | 657959,6 ? | | Logs | | master | | - | | check |
| 2019-05-22 12:08 | | 125 min | | SUCCESS | | 660615,1 ? | | Logs | | master | | - | | check |
| 2019-05-22 11:13 | | 134 min | | SUCCESS | | 660555,3 ? | | Logs | | master | | - | | check |
| 2019-05-22 08:27 | | 125 min | | SUCCESS | | 660555,2 ? | | Logs | | master | | - | | check |
| 2019-05-22 04:44 | | 118 min | | SUCCESS | | 657959,6 ? | | Logs | | master | | - | | check |
| 2019-05-22 03:40 | | 123 min | | SUCCESS | | 660508,5 ? | | Logs | | master | | - | | check |
| 2019-05-22 03:40 | | 123 min | | SUCCESS | | 660508,5 ? | | Logs | | master | | - | | check |
| 2019-05-21 23:55 | | 124 min | | SUCCESS | | 660508,4 ? | | Logs | | master | | - | | check |
| 2019-05-21 23:55 | | 124 min | | SUCCESS | | 660508,4 ? | | Logs | | master | | - | | check |
| 2019-05-21 20:24 | | 6 min | | Please investigate. Reason was NOT FOUND. | | 660508,2 ? | | Logs | | master | | - | | check |
| 2019-05-21 20:24 | | 6 min | | Please investigate. Reason was NOT FOUND. | | 660508,2 ? | | Logs | | master | | - | | check |
| 2019-05-21 15:46 | | 134 min | | SUCCESS | | 656398,11 ? | | Logs | | master | | - | | check |
| 2019-05-21 15:46 | | 134 min | | SUCCESS | | 656398,11 ? | | Logs | | master | | - | | check |
| 2019-05-21 15:33 | | 122 min | | SUCCESS | | 660379,1 ? | | Logs | | master | | - | | check |
| 2019-05-21 15:25 | | 140 min | | SUCCESS | | 657959,4 ? | | Logs | | master | | - | | check |
| 2019-05-21 14:43 | | 20 min | | Please investigate. Reason was NOT FOUND. | | 659906,10 ? | | Logs | | master | | - | | check |
| 2019-05-21 14:43 | | 20 min | | Please investigate. Reason was NOT FOUND. | | 659906,10 ? | | Logs | | master | | - | | check |
| 2019-05-21 13:57 | | 122 min | | SUCCESS | | 660354,1 ? | | Logs | | master | | - | | check |
| 2019-05-21 13:51 | | 124 min | | SUCCESS | | 660176,5 ? | | Logs | | master | | - | | check |
| 2019-05-21 01:54 | | 17 min | | Please investigate. Reason was NOT FOUND. | | 659906,9 ? | | Logs | | master | | - | | check |
| 2019-05-21 01:54 | | 17 min | | Please investigate. Reason was NOT FOUND. | | 659906,9 ? | | Logs | | master | | - | | check |
| 2019-05-21 00:34 | | 74 min | | IPMI to nodes failed. | | 659794,4 ? | | Logs | | master | | - | | check |
| 2019-05-21 00:32 | | 220 min | | Job timeout. | | 660176,4 ? | | Logs | | master | | Logstash | | check |
| 2019-05-20 18:20 | | 22 min | | Please investigate. Reason was NOT FOUND. | | 659906,8 ? | | Logs | | master | | - | | check |
| 2019-05-20 18:20 | | 22 min | | Please investigate. Reason was NOT FOUND. | | 659906,8 ? | | Logs | | master | | - | | check |
| 2019-05-20 18:01 | | 127 min | | SUCCESS | | 660150,1 ? | | Logs | | master | | - | | check |
| 2019-05-20 18:01 | | 127 min | | SUCCESS | | 660150,1 ? | | Logs | | master | | - | | check |
| 2019-05-20 17:29 | | 22 min | | /home/zuul/containers-prepare-parameters.yaml file missing. | | 660176,1 ? | | Logs | | master | | Logstash | | check |
| 2019-05-20 15:11 | | 127 min | | SUCCESS | | 659794,2 ? | | Logs | | master | | - | | check |
| 2019-05-20 15:09 | | 92 min | | Overcloud deploy failed. Overcloud stack: FAILED. | | 659909,6 ? | | Logs | | master | | Logstash | | check |
| 2019-05-20 14:54 | | 134 min | | SUCCESS | | 660100,1 ? | | Logs | | master | | - | | check |
| 2019-05-20 13:53 | | 21 min | | Please investigate. Reason was NOT FOUND. | | 659906,6 ? | | Logs | | master | | - | | check |
| 2019-05-20 13:53 | | 21 min | | Please investigate. Reason was NOT FOUND. | | 659906,6 ? | | Logs | | master | | - | | check |
| 2019-05-20 13:42 | | 122 min | | SUCCESS | | 660036,2 ? | | Logs | | master | | - | | check |
| 2019-05-20 13:26 | | 22 min | | Please investigate. Reason was NOT FOUND. | | 659906,5 ? | | Logs | | master | | - | | check |
| 2019-05-20 13:26 | | 22 min | | Please investigate. Reason was NOT FOUND. | | 659906,5 ? | | Logs | | master | | - | | check |
| 2019-05-20 10:45 | | 4 min | | Please investigate. Reason was NOT FOUND. | | 660036,2 ? | | Logs | | master | | - | | check |
| 2019-05-20 07:38 | | 4 min | | Please investigate. Reason was NOT FOUND. | | 660036,1 ? | | Logs | | master | | - | | check |
| 2019-05-20 02:22 | | 91 min | | Overcloud deploy failed. Overcloud stack: FAILED. | | 659907,6 ? | | Logs | | master | | Logstash | | check |
| 2019-05-20 00:01 | | 14 min | | Please investigate. Reason was NOT FOUND. | | 659909,5 ? | | Logs | | master | | - | | check |
| 2019-05-19 23:59 | | 19 min | | Please investigate. Reason was NOT FOUND. | | 659906,4 ? | | Logs | | master | | - | | check |
| 2019-05-19 23:59 | | 19 min | | Please investigate. Reason was NOT FOUND. | | 659906,4 ? | | Logs | | master | | - | | check |
| 2019-05-19 22:11 | | 115 min | | SUCCESS | | 659907,4 ? | | Logs | | master | | - | | check |
| 2019-05-19 13:33 | | 32 min | | Undercloud install failed. | | 659909,3 ? | | Logs | | master | | Logstash | | check |
| 2019-05-19 13:32 | | 122 min | | SUCCESS | | 659907,3 ? | | Logs | | master | | - | | check |
| 2019-05-19 02:21 | | 17 min | | Please investigate. Reason was NOT FOUND. | | 659906,3 ? | | Logs | | master | | - | | check |
| 2019-05-19 02:21 | | 17 min | | Please investigate. Reason was NOT FOUND. | | 659906,3 ? | | Logs | | master | | - | | check |
| 2019-05-19 01:59 | | 92 min | | Overcloud deploy failed. Overcloud stack: FAILED. | | 659907,2 ? | | Logs | | master | | Logstash | | check |

tripleo-build-containers-centos-7-stein

tripleo-build-containers-centos-7-stein

Date Length Reason Patch Logs Branch Logstash Pipeline
| 2019-05-24 23:41 | | 53 min | | SUCCESS | | 661387,1 ? | | Logs | | master | | - | | check |
| 2019-05-24 23:08 | | 47 min | | SUCCESS | | 656997,9 ? | | Logs | | master | | - | | check |
| 2019-05-23 13:22 | | 44 min | | SUCCESS | | 653934,4 ? | | Logs | | master | | - | | check |
| 2019-05-21 23:15 | | 44 min | | SUCCESS | | 660418,1 ? | | Logs | | stable/stein | | - | | gate |
| 2019-05-21 19:36 | | 38 min | | SUCCESS | | 660418,1 ? | | Logs | | stable/stein | | - | | check |
| 2019-05-21 00:58 | | 46 min | | SUCCESS | | 656997,8 ? | | Logs | | master | | - | | check |
| 2019-05-20 20:36 | | 54 min | | SUCCESS | | 653151,7 ? | | Logs | | master | | - | | gate |
| 2019-05-20 18:36 | | 52 min | | SUCCESS | | 653934,4 ? | | Logs | | master | | - | | check |
| 2019-05-20 18:13 | | 40 min | | SUCCESS | | 653151,7 ? | | Logs | | master | | - | | check |
| 2019-05-20 15:04 | | 47 min | | SUCCESS | | 657434,5 ? | | Logs | | master | | - | | gate |
| 2019-05-20 09:06 | | 12 min | | Please investigate. Reason was NOT FOUND. | | 653934,4 ? | | Logs | | master | | - | | check |
| 2019-05-20 08:26 | | 11 min | | Please investigate. Reason was NOT FOUND. | | 653151,7 ? | | Logs | | master | | - | | gate |

tripleo-ci-centos-7-scenario002-multinode-oooq-container

tripleo-ci-centos-7-scenario002-multinode-oooq-container

Date Length Reason Patch Logs Branch Logstash Pipeline
| 2019-05-24 22:51 | | 169 min | | SUCCESS | | 656797,3 ? | | Logs | | stable/rocky | | - | | check |
| 2019-05-24 19:26 | | 170 min | | SUCCESS | | 660895,1 ? | | Logs | | stable/queens | | - | | check |
| 2019-05-24 10:11 | | 145 min | | Please investigate. Reason was NOT FOUND. | | 660895,1 ? | | Logs | | stable/queens | | - | | check |
| 2019-05-23 16:33 | | 167 min | | SUCCESS | | 660997,2 ? | | Logs | | stable/rocky | | - | | check |
| 2019-05-23 12:06 | | 166 min | | SUCCESS | | 660943,1 ? | | Logs | | stable/rocky | | - | | check |
| 2019-05-23 10:05 | | 160 min | | Please investigate. Reason was NOT FOUND. | | 660895,1 ? | | Logs | | stable/queens | | - | | check |
| 2019-05-21 16:47 | | 159 min | | SUCCESS | | 660377,1 ? | | Logs | | stable/rocky | | - | | check |
| 2019-05-20 08:57 | | 152 min | | SUCCESS | | 660023,1 ? | | Logs | | stable/queens | | - | | check |

tripleo-ci-centos-7-scenario002-standalone

tripleo-ci-centos-7-scenario002-standalone

Date Length Reason Patch Logs Branch Logstash Pipeline
| 2019-05-26 00:45 | | 48 min | | Please investigate. Reason was NOT FOUND. | | 661267,4 ? | | Logs | | master | | - | | check |
| 2019-05-25 14:33 | | 49 min | | Please investigate. Reason was NOT FOUND. | | 661267,4 ? | | Logs | | master | | - | | check |
| 2019-05-25 09:49 | | 98 min | | Tempest tests FAILED. | | 661265,1 ? | | Logs | | master | | Logstash | | check |
| 2019-05-25 02:22 | | 58 min | | Please investigate. Reason was NOT FOUND. | | 661267,4 ? | | Logs | | master | | - | | check |
| 2019-05-25 00:07 | | 100 min | | SUCCESS | | 661093,16 ? | | Logs | | master | | - | | check |
| 2019-05-24 23:57 | | 59 min | | Please investigate. Reason was NOT FOUND. | | 660791,22 ? | | Logs | | master | | - | | check |
| 2019-05-24 23:41 | | 101 min | | SUCCESS | | 661387,1 ? | | Logs | | master | | - | | check |
| 2019-05-24 23:28 | | 59 min | | Please investigate. Reason was NOT FOUND. | | 661377,2 ? | | Logs | | master | | - | | check |
| 2019-05-24 23:22 | | 54 min | | Please investigate. Reason was NOT FOUND. | | 661267,4 ? | | Logs | | master | | - | | check |
| 2019-05-24 22:44 | | 114 min | | SUCCESS | | 658118,9 ? | | Logs | | master | | - | | check |
| 2019-05-24 21:29 | | 99 min | | SUCCESS | | 660745,4 ? | | Logs | | master | | - | | check |
| 2019-05-24 20:24 | | 100 min | | SUCCESS | | 661348,1 ? | | Logs | | master | | - | | check |
| 2019-05-24 19:24 | | 92 min | | SUCCESS | | 656984,9 ? | | Logs | | master | | - | | check |
| 2019-05-24 18:51 | | 93 min | | SUCCESS | | 643056,16 ? | | Logs | | master | | - | | check |
| 2019-05-24 18:49 | | 53 min | | Please investigate. Reason was NOT FOUND. | | 661267,4 ? | | Logs | | master | | - | | check |
| 2019-05-24 15:19 | | 101 min | | SUCCESS | | 659794,11 ? | | Logs | | master | | - | | check |
| 2019-05-24 15:16 | | 96 min | | SUCCESS | | 661265,1 ? | | Logs | | master | | - | | check |
| 2019-05-24 14:22 | | 99 min | | SUCCESS | | 643056,15 ? | | Logs | | master | | - | | check |
| 2019-05-24 03:35 | | 105 min | | SUCCESS | | 661093,8 ? | | Logs | | master | | - | | check |
| 2019-05-24 02:44 | | 55 min | | Please investigate. Reason was NOT FOUND. | | 660791,11 ? | | Logs | | master | | - | | check |
| 2019-05-24 00:13 | | 21 min | | Please investigate. Reason was NOT FOUND. | | 659794,10 ? | | Logs | | master | | - | | check |
| 2019-05-23 22:31 | | 96 min | | SUCCESS | | 660991,1 ? | | Logs | | stable/stein | | - | | gate |
| 2019-05-23 21:38 | | 105 min | | SUCCESS | | 660794,6 ? | | Logs | | master | | - | | check |
| 2019-05-23 21:34 | | 99 min | | SUCCESS | | 661049,1 ? | | Logs | | master | | - | | check |
| 2019-05-23 21:21 | | 112 min | | SUCCESS | | 660111,1 ? | | Logs | | master | | - | | gate |
| 2019-05-23 20:05 | | 103 min | | SUCCESS | | 661030,2 ? | | Logs | | master | | - | | check |
| 2019-05-23 18:40 | | 91 min | | SUCCESS | | 652971,8 ? | | Logs | | master | | - | | check |
| 2019-05-23 18:40 | | 91 min | | SUCCESS | | 652971,8 ? | | Logs | | master | | - | | check |
| 2019-05-23 16:34 | | 93 min | | SUCCESS | | 660991,1 ? | | Logs | | stable/stein | | - | | check |
| 2019-05-23 12:15 | | 73 min | | SUCCESS | | 660942,2 ? | | Logs | | stable/stein | | - | | check |
| 2019-05-23 08:12 | | 114 min | | SUCCESS | | 654713,4 ? | | Logs | | master | | - | | check |
| 2019-05-23 07:06 | | 123 min | | SUCCESS | | 654863,3 ? | | Logs | | master | | - | | check |
| 2019-05-23 04:41 | | 27 min | | Please investigate. Reason was NOT FOUND. | | 659794,6 ? | | Logs | | master | | - | | check |
| 2019-05-23 04:03 | | 50 min | | Please investigate. Reason was NOT FOUND. | | 660791,4 ? | | Logs | | master | | - | | check |
| 2019-05-23 03:37 | | 112 min | | SUCCESS | | 614633,13 ? | | Logs | | master | | - | | check |
| 2019-05-23 03:33 | | 102 min | | SUCCESS | | 660221,3 ? | | Logs | | master | | - | | check |
| 2019-05-23 03:21 | | 97 min | | SUCCESS | | 659148,3 ? | | Logs | | master | | - | | check |
| 2019-05-23 02:38 | | 110 min | | SUCCESS | | 660111,1 ? | | Logs | | master | | - | | gate |
| 2019-05-23 02:29 | | 114 min | | SUCCESS | | 659394,2 ? | | Logs | | master | | - | | check |
| 2019-05-22 15:26 | | 115 min | | SUCCESS | | 660564,3 ? | | Logs | | master | | - | | gate |
| 2019-05-22 14:58 | | 92 min | | SUCCESS | | 660561,2 ? | | Logs | | stable/stein | | - | | check |
| 2019-05-22 12:01 | | 92 min | | SUCCESS | | 660564,3 ? | | Logs | | master | | - | | check |
| 2019-05-21 22:11 | | 108 min | | SUCCESS | | 651732,3 ? | | Logs | | master | | - | | gate |
| 2019-05-21 21:17 | | 86 min | | SUCCESS | | 660334,2 ? | | Logs | | stable/stein | | - | | gate |
| 2019-05-21 19:21 | | 108 min | | SUCCESS | | 651732,3 ? | | Logs | | master | | - | | check |
| 2019-05-21 19:19 | | 138 min | | SUCCESS | | 649446,3 ? | | Logs | | master | | - | | gate |
| 2019-05-21 18:27 | | 40 min | | Please investigate. Reason was NOT FOUND. | | 634241,10 ? | | Logs | | master | | - | | check |
| 2019-05-21 16:52 | | 97 min | | SUCCESS | | 660334,2 ? | | Logs | | stable/stein | | - | | check |
| 2019-05-21 12:54 | | 88 min | | SUCCESS | | 660334,1 ? | | Logs | | stable/stein | | - | | check |
| 2019-05-21 12:39 | | 96 min | | SUCCESS | | 659238,4 ? | | Logs | | master | | - | | check |
| 2019-05-21 11:47 | | 109 min | | SUCCESS | | 651732,3 ? | | Logs | | master | | - | | gate |
| 2019-05-21 09:29 | | 107 min | | SUCCESS | | 651732,3 ? | | Logs | | master | | - | | check |
| 2019-05-21 02:02 | | 109 min | | SUCCESS | | 656984,8 ? | | Logs | | master | | - | | check |
| 2019-05-21 00:18 | | 37 min | | Please investigate. Reason was NOT FOUND. | | 660221,1 ? | | Logs | | master | | - | | check |
| 2019-05-21 00:12 | | 126 min | | SUCCESS | | 659794,4 ? | | Logs | | master | | - | | check |
| 2019-05-20 22:46 | | 95 min | | SUCCESS | | 656984,8 ? | | Logs | | master | | - | | check |
| 2019-05-20 21:10 | | 110 min | | SUCCESS | | 657919,6 ? | | Logs | | master | | - | | gate |
| 2019-05-20 20:46 | | 108 min | | SUCCESS | | 659148,2 ? | | Logs | | master | | - | | check |
| 2019-05-20 18:33 | | 93 min | | SUCCESS | | 657919,6 ? | | Logs | | master | | - | | check |
| 2019-05-20 16:37 | | 91 min | | SUCCESS | | 660093,1 ? | | Logs | | stable/stein | | - | | gate |
| 2019-05-20 15:34 | | 119 min | | SUCCESS | | 659794,2 ? | | Logs | | master | | - | | check |
| 2019-05-20 14:59 | | 98 min | | SUCCESS | | 643056,12 ? | | Logs | | master | | - | | check |
| 2019-05-20 14:21 | | 101 min | | SUCCESS | | 659238,3 ? | | Logs | | master | | - | | check |
| 2019-05-20 13:50 | | 80 min | | SUCCESS | | 660093,1 ? | | Logs | | stable/stein | | - | | check |
| 2019-05-20 12:31 | | 101 min | | SUCCESS | | 660036,2 ? | | Logs | | master | | - | | check |
| 2019-05-20 12:19 | | 101 min | | SUCCESS | | 657919,6 ? | | Logs | | master | | - | | gate |
| 2019-05-20 07:52 | | 6 min | | Pip install FAIL. | | 660036,1 ? | | Logs | | master | | Logstash | | check |
| 2019-05-19 11:40 | | 109 min | | SUCCESS | | 647467,11 ? | | Logs | | master | | - | | check |

tripleo-ci-centos-7-containerized-undercloud-upgrades

tripleo-ci-centos-7-containerized-undercloud-upgrades

Date Length Reason Patch Logs Branch Logstash Pipeline
| 2019-05-26 00:54 | | 123 min | | Please investigate. Reason was NOT FOUND. | | 660995,5 ? | | Logs | | master | | - | | check |
| 2019-05-26 00:45 | | 85 min | | Undercloud install failed. | | 661267,4 ? | | Logs | | master | | Logstash | | check |
| 2019-05-26 00:39 | | 127 min | | Please investigate. Reason was NOT FOUND. | | 661001,4 ? | | Logs | | master | | - | | check |
| 2019-05-25 14:33 | | 89 min | | Undercloud install failed. | | 661267,4 ? | | Logs | | master | | Logstash | | check |
| 2019-05-25 09:49 | | 110 min | | Please investigate. Reason was NOT FOUND. | | 661265,1 ? | | Logs | | master | | - | | check |
| 2019-05-25 09:13 | | 119 min | | Please investigate. Reason was NOT FOUND. | | 661434,3 ? | | Logs | | master | | - | | check |
| 2019-05-25 05:24 | | 144 min | | Please investigate. Reason was NOT FOUND. | | 661361,4 ? | | Logs | | master | | - | | check |
| 2019-05-25 02:22 | | 100 min | | Undercloud install failed. | | 661267,4 ? | | Logs | | master | | Logstash | | check |
| 2019-05-25 00:45 | | 121 min | | Please investigate. Reason was NOT FOUND. | | 661409,1 ? | | Logs | | master | | - | | check |
| 2019-05-25 00:17 | | 116 min | | Please investigate. Reason was NOT FOUND. | | 660995,2 ? | | Logs | | master | | - | | check |
| 2019-05-25 00:07 | | 111 min | | Please investigate. Reason was NOT FOUND. | | 661093,16 ? | | Logs | | master | | - | | check |
| 2019-05-24 23:57 | | 98 min | | Undercloud install failed. | | 660791,22 ? | | Logs | | master | | Logstash | | check |
| 2019-05-24 23:57 | | 77 min | | Please investigate. Reason was NOT FOUND. | | 661393,1 ? | | Logs | | stable/stein | | - | | check |
| 2019-05-24 23:41 | | 187 min | | Job timeout. | | 661387,1 ? | | Logs | | master | | Logstash | | check |
| 2019-05-24 23:28 | | 85 min | | Undercloud install failed. | | 661377,2 ? | | Logs | | master | | Logstash | | check |
| 2019-05-24 23:22 | | 96 min | | Undercloud install failed. | | 661267,4 ? | | Logs | | master | | Logstash | | check |
| 2019-05-24 23:08 | | 127 min | | Please investigate. Reason was NOT FOUND. | | 656997,9 ? | | Logs | | master | | - | | check |
| 2019-05-24 22:51 | | 114 min | | SUCCESS | | 656797,3 ? | | Logs | | stable/rocky | | - | | check |
| 2019-05-24 22:47 | | 122 min | | Please investigate. Reason was NOT FOUND. | | 643051,13 ? | | Logs | | master | | - | | check |
| 2019-05-24 22:44 | | 114 min | | Please investigate. Reason was NOT FOUND. | | 658118,9 ? | | Logs | | master | | - | | check |
| 2019-05-24 22:16 | | 120 min | | Please investigate. Reason was NOT FOUND. | | 661137,1 ? | | Logs | | master | | - | | check |
| 2019-05-24 22:16 | | 120 min | | Please investigate. Reason was NOT FOUND. | | 661137,1 ? | | Logs | | master | | - | | check |
| 2019-05-24 21:36 | | 109 min | | Please investigate. Reason was NOT FOUND. | | 660726,17 ? | | Logs | | master | | - | | check |
| 2019-05-24 21:29 | | 130 min | | Please investigate. Reason was NOT FOUND. | | 660745,4 ? | | Logs | | master | | - | | check |
| 2019-05-24 21:22 | | 128 min | | Please investigate. Reason was NOT FOUND. | | 660744,4 ? | | Logs | | master | | - | | check |
| 2019-05-24 21:04 | | 77 min | | Please investigate. Reason was NOT FOUND. | | 661352,1 ? | | Logs | | stable/stein | | - | | check |
| 2019-05-24 20:24 | | 111 min | | Please investigate. Reason was NOT FOUND. | | 661348,1 ? | | Logs | | master | | - | | check |
| 2019-05-24 19:52 | | 78 min | | Please investigate. Reason was NOT FOUND. | | 661340,1 ? | | Logs | | stable/stein | | - | | check |
| 2019-05-24 19:51 | | 113 min | | Please investigate. Reason was NOT FOUND. | | 661343,1 ? | | Logs | | master | | - | | check |
| 2019-05-24 19:41 | | 112 min | | Please investigate. Reason was NOT FOUND. | | 661101,2 ? | | Logs | | master | | - | | check |
| 2019-05-24 19:39 | | 128 min | | Please investigate. Reason was NOT FOUND. | | 661001,2 ? | | Logs | | master | | - | | check |
| 2019-05-24 19:24 | | 129 min | | Please investigate. Reason was NOT FOUND. | | 656984,9 ? | | Logs | | master | | - | | check |
| 2019-05-24 19:12 | | 70 min | | Please investigate. Reason was NOT FOUND. | | 661339,1 ? | | Logs | | stable/stein | | - | | check |
| 2019-05-24 18:51 | | 109 min | | Please investigate. Reason was NOT FOUND. | | 643056,16 ? | | Logs | | master | | - | | check |
| 2019-05-24 18:49 | | 101 min | | Undercloud install failed. | | 661267,4 ? | | Logs | | master | | Logstash | | check |
| 2019-05-24 18:49 | | 108 min | | Please investigate. Reason was NOT FOUND. | | 661330,2 ? | | Logs | | master | | - | | check |
| 2019-05-24 18:27 | | 63 min | | Please investigate. Reason was NOT FOUND. | | 661302,4 ? | | Logs | | master | | - | | check |
| 2019-05-24 17:33 | | 112 min | | Please investigate. Reason was NOT FOUND. | | 661290,1 ? | | Logs | | master | | - | | check |
| 2019-05-24 15:59 | | 110 min | | Please investigate. Reason was NOT FOUND. | | 660726,16 ? | | Logs | | master | | - | | check |
| 2019-05-24 15:34 | | 112 min | | Please investigate. Reason was NOT FOUND. | | 659926,3 ? | | Logs | | master | | - | | check |
| 2019-05-24 15:30 | | 97 min | | Undercloud install failed. | | 659925,3 ? | | Logs | | master | | Logstash | | check |
| 2019-05-24 15:19 | | 109 min | | Please investigate. Reason was NOT FOUND. | | 659794,11 ? | | Logs | | master | | - | | check |
| 2019-05-24 15:16 | | 109 min | | Please investigate. Reason was NOT FOUND. | | 661265,1 ? | | Logs | | master | | - | | check |
| 2019-05-24 14:34 | | 78 min | | Please investigate. Reason was NOT FOUND. | | 661261,1 ? | | Logs | | stable/stein | | - | | check |
| 2019-05-24 14:22 | | 113 min | | Please investigate. Reason was NOT FOUND. | | 643056,15 ? | | Logs | | master | | - | | check |
| 2019-05-24 11:56 | | 127 min | | Please investigate. Reason was NOT FOUND. | | 660737,2 ? | | Logs | | master | | - | | check |
| 2019-05-24 11:29 | | 109 min | | Please investigate. Reason was NOT FOUND. | | 661030,3 ? | | Logs | | master | | - | | check |
| 2019-05-24 11:14 | | 83 min | | Undercloud install failed. | | 660724,4 ? | | Logs | | master | | Logstash | | check |
| 2019-05-24 10:38 | | 64 min | | Please investigate. Reason was NOT FOUND. | | 659906,10 ? | | Logs | | master | | - | | check |
| 2019-05-24 10:38 | | 64 min | | Please investigate. Reason was NOT FOUND. | | 659906,10 ? | | Logs | | master | | - | | check |
| 2019-05-24 10:00 | | 115 min | | Please investigate. Reason was NOT FOUND. | | 656269,2 ? | | Logs | | master | | - | | check |
| 2019-05-24 09:23 | | 112 min | | Please investigate. Reason was NOT FOUND. | | 660559,1 ? | | Logs | | master | | - | | check |
| 2019-05-24 03:35 | | 116 min | | Please investigate. Reason was NOT FOUND. | | 661093,8 ? | | Logs | | master | | - | | check |
| 2019-05-24 02:51 | | 127 min | | Please investigate. Reason was NOT FOUND. | | 660726,14 ? | | Logs | | master | | - | | check |
| 2019-05-24 02:44 | | 85 min | | Undercloud install failed. | | 660791,11 ? | | Logs | | master | | Logstash | | check |
| 2019-05-24 02:08 | | 77 min | | Please investigate. Reason was NOT FOUND. | | 661139,1 ? | | Logs | | stable/stein | | - | | check |
| 2019-05-24 02:02 | | 105 min | | Please investigate. Reason was NOT FOUND. | | 661137,1 ? | | Logs | | master | | - | | check |
| 2019-05-24 02:02 | | 105 min | | Please investigate. Reason was NOT FOUND. | | 661137,1 ? | | Logs | | master | | - | | check |
| 2019-05-24 00:13 | | 120 min | | Please investigate. Reason was NOT FOUND. | | 659794,10 ? | | Logs | | master | | - | | check |
| 2019-05-23 23:52 | | 76 min | | Please investigate. Reason was NOT FOUND. | | 661108,2 ? | | Logs | | stable/stein | | - | | check |
| 2019-05-23 23:37 | | 121 min | | Undercloud install failed. | | 661101,1 ? | | Logs | | master | | Logstash | | check |
| 2019-05-23 23:33 | | 116 min | | Undercloud install failed. | | 661109,1 ? | | Logs | | master | | Logstash | | check |
| 2019-05-23 23:33 | | 114 min | | SUCCESS | | 661103,1 ? | | Logs | | stable/rocky | | - | | check |
| 2019-05-23 23:33 | | 107 min | | SUCCESS | | 661110,1 ? | | Logs | | stable/rocky | | - | | check |
| 2019-05-23 23:14 | | 78 min | | Please investigate. Reason was NOT FOUND. | | 661019,2 ? | | Logs | | stable/stein | | - | | check |
| 2019-05-23 23:14 | | 115 min | | Please investigate. Reason was NOT FOUND. | | 643051,11 ? | | Logs | | master | | - | | check |
| 2019-05-23 23:01 | | 129 min | | Please investigate. Reason was NOT FOUND. | | 661095,1 ? | | Logs | | master | | - | | check |
| 2019-05-23 21:38 | | 110 min | | Please investigate. Reason was NOT FOUND. | | 660794,6 ? | | Logs | | master | | - | | check |
| 2019-05-23 21:34 | | 109 min | | Please investigate. Reason was NOT FOUND. | | 661049,1 ? | | Logs | | master | | - | | check |
| 2019-05-23 21:19 | | 117 min | | Please investigate. Reason was NOT FOUND. | | 657962,6 ? | | Logs | | master | | - | | check |
| 2019-05-23 20:40 | | 77 min | | Please investigate. Reason was NOT FOUND. | | 661033,1 ? | | Logs | | stable/stein | | - | | check |
| 2019-05-23 20:32 | | 117 min | | SUCCESS | | 661035,1 ? | | Logs | | stable/rocky | | - | | check |
| 2019-05-23 20:29 | | 111 min | | Please investigate. Reason was NOT FOUND. | | 661034,1 ? | | Logs | | master | | - | | check |
| 2019-05-23 20:06 | | 78 min | | Please investigate. Reason was NOT FOUND. | | 661023,1 ? | | Logs | | stable/stein | | - | | check |
| 2019-05-23 20:05 | | 120 min | | Please investigate. Reason was NOT FOUND. | | 661030,2 ? | | Logs | | master | | - | | check |
| 2019-05-23 19:47 | | 107 min | | SUCCESS | | 661029,1 ? | | Logs | | stable/rocky | | - | | check |
| 2019-05-23 19:38 | | 73 min | | Please investigate. Reason was NOT FOUND. | | 661026,1 ? | | Logs | | stable/stein | | - | | check |
| 2019-05-23 19:10 | | 112 min | | Please investigate. Reason was NOT FOUND. | | 660222,1 ? | | Logs | | master | | - | | check |
| 2019-05-23 19:09 | | 94 min | | Undercloud install failed. | | 660726,9 ? | | Logs | | master | | Logstash | | check |
| 2019-05-23 19:03 | | 82 min | | Please investigate. Reason was NOT FOUND. | | 661019,1 ? | | Logs | | stable/stein | | - | | check |
| 2019-05-23 19:02 | | 118 min | | Please investigate. Reason was NOT FOUND. | | 661014,1 ? | | Logs | | master | | - | | check |
| 2019-05-23 18:53 | | 120 min | | Please investigate. Reason was NOT FOUND. | | 661009,3 ? | | Logs | | master | | - | | check |
| 2019-05-23 18:45 | | 114 min | | Please investigate. Reason was NOT FOUND. | | 660111,1 ? | | Logs | | master | | - | | check |
| 2019-05-23 18:40 | | 123 min | | Please investigate. Reason was NOT FOUND. | | 652971,8 ? | | Logs | | master | | - | | check |
| 2019-05-23 18:40 | | 123 min | | Please investigate. Reason was NOT FOUND. | | 652971,8 ? | | Logs | | master | | - | | check |
| 2019-05-23 17:37 | | 117 min | | SUCCESS | | 660764,3 ? | | Logs | | stable/rocky | | - | | check |
| 2019-05-23 16:59 | | 92 min | | Undercloud install failed. | | 660891,3 ? | | Logs | | master | | Logstash | | check |
| 2019-05-23 16:48 | | 99 min | | Undercloud install failed. | | 661001,1 ? | | Logs | | master | | Logstash | | check |
| 2019-05-23 16:43 | | 82 min | | Undercloud install failed. | | 657959,7 ? | | Logs | | master | | Logstash | | check |
| 2019-05-23 16:34 | | 76 min | | Please investigate. Reason was NOT FOUND. | | 660991,1 ? | | Logs | | stable/stein | | - | | check |
| 2019-05-23 16:33 | | 97 min | | SUCCESS | | 660997,2 ? | | Logs | | stable/rocky | | - | | check |
| 2019-05-23 16:14 | | 113 min | | Undercloud install failed. | | 660744,2 ? | | Logs | | master | | Logstash | | check |
| 2019-05-23 16:10 | | 91 min | | Undercloud install failed. | | 656398,12 ? | | Logs | | master | | Logstash | | check |
| 2019-05-23 16:10 | | 91 min | | Undercloud install failed. | | 656398,12 ? | | Logs | | master | | Logstash | | check |
| 2019-05-23 16:09 | | 126 min | | Please investigate. Reason was NOT FOUND. | | 660995,1 ? | | Logs | | master | | - | | check |
| 2019-05-23 15:57 | | 90 min | | Undercloud install failed. | | 660745,2 ? | | Logs | | master | | Logstash | | check |
| 2019-05-23 14:47 | | 18 min | | /home/zuul/containers-prepare-parameter.yaml file missing. | | 660176,6 ? | | Logs | | master | | Logstash | | check |
| 2019-05-23 13:22 | | 97 min | | Undercloud install failed. | | 653934,4 ? | | Logs | | master | | Logstash | | check |
| 2019-05-23 13:20 | | 100 min | | Undercloud install failed. | | 660345,2 ? | | Logs | | master | | Logstash | | check |
| 2019-05-23 12:47 | | 84 min | | Please investigate. Reason was NOT FOUND. | | 660909,2 ? | | Logs | | master | | - | | check |
| 2019-05-23 12:15 | | 72 min | | Please investigate. Reason was NOT FOUND. | | 660942,2 ? | | Logs | | stable/stein | | - | | check |
| 2019-05-23 12:14 | | 107 min | | Undercloud install failed. | | 660689,5 ? | | Logs | | master | | Logstash | | check |
| 2019-05-23 12:06 | | 109 min | | SUCCESS | | 660943,1 ? | | Logs | | stable/rocky | | - | | check |
| 2019-05-23 11:49 | | 121 min | | SUCCESS | | 660938,1 ? | | Logs | | stable/rocky | | - | | check |
| 2019-05-23 10:53 | | 82 min | | Please investigate. Reason was NOT FOUND. | | 660903,1 ? | | Logs | | stable/stein | | - | | check |
| 2019-05-23 10:36 | | 79 min | | Please investigate. Reason was NOT FOUND. | | 659130,5 ? | | Logs | | stable/stein | | - | | check |
| 2019-05-23 09:29 | | 102 min | | Undercloud install failed. | | 660559,1 ? | | Logs | | master | | Logstash | | check |
| 2019-05-23 09:28 | | 103 min | | Please investigate. Reason was NOT FOUND. | | 660891,1 ? | | Logs | | master | | - | | check |
| 2019-05-23 08:12 | | 132 min | | Please investigate. Reason was NOT FOUND. | | 654713,4 ? | | Logs | | master | | - | | check |
| 2019-05-23 07:08 | | 98 min | | Undercloud install failed. | | 660728,1 ? | | Logs | | master | | Logstash | | check |
| 2019-05-23 06:54 | | 68 min | | Please investigate. Reason was NOT FOUND. | | 660875,1 ? | | Logs | | stable/stein | | - | | check |
| 2019-05-23 05:12 | | 102 min | | Undercloud install failed. | | 660689,4 ? | | Logs | | master | | Logstash | | check |
| 2019-05-23 05:03 | | 118 min | | SUCCESS | | 660849,1 ? | | Logs | | stable/rocky | | - | | check |
| 2019-05-23 04:41 | | 113 min | | Please investigate. Reason was NOT FOUND. | | 659794,6 ? | | Logs | | master | | - | | check |
| 2019-05-23 04:27 | | 104 min | | Please investigate. Reason was NOT FOUND. | | 660508,5 ? | | Logs | | master | | - | | check |
| 2019-05-23 04:27 | | 104 min | | Please investigate. Reason was NOT FOUND. | | 660508,5 ? | | Logs | | master | | - | | check |
| 2019-05-23 04:03 | | 90 min | | Undercloud install failed. | | 660791,4 ? | | Logs | | master | | Logstash | | check |
| 2019-05-23 03:53 | | 96 min | | Undercloud install failed. | | 660726,5 ? | | Logs | | master | | Logstash | | check |
| 2019-05-23 03:37 | | 94 min | | Undercloud install failed. | | 614633,13 ? | | Logs | | master | | Logstash | | check |
| 2019-05-23 03:33 | | 101 min | | Undercloud install failed. | | 660221,3 ? | | Logs | | master | | Logstash | | check |
| 2019-05-23 03:21 | | 97 min | | Undercloud install failed. | | 659148,3 ? | | Logs | | master | | Logstash | | check |
| 2019-05-23 03:15 | | 98 min | | Undercloud install failed. | | 660212,2 ? | | Logs | | master | | Logstash | | check |
| 2019-05-23 03:13 | | 97 min | | Undercloud install failed. | | 653838,7 ? | | Logs | | master | | Logstash | | check |
| 2019-05-23 03:05 | | 66 min | | Please investigate. Reason was NOT FOUND. | | 660763,1 ? | | Logs | | stable/stein | | - | | check |
| 2019-05-23 02:59 | | 88 min | | Undercloud install failed. | | 653843,7 ? | | Logs | | master | | Logstash | | check |
| 2019-05-23 02:54 | | 47 min | | Undercloud install failed. | | 659144,4 ? | | Logs | | master | | Logstash | | check |
| 2019-05-23 02:37 | | 117 min | | SUCCESS | | 660764,2 ? | | Logs | | stable/rocky | | - | | check |
| 2019-05-23 02:29 | | 116 min | | Please investigate. Reason was NOT FOUND. | | 659394,2 ? | | Logs | | master | | - | | check |
| 2019-05-23 02:22 | | 96 min | | Undercloud install failed. | | 660744,1 ? | | Logs | | master | | Logstash | | check |
| 2019-05-23 02:22 | | 99 min | | Undercloud install failed. | | 660745,1 ? | | Logs | | master | | Logstash | | check |
| 2019-05-23 00:55 | | 70 min | | Please investigate. Reason was NOT FOUND. | | 660737,1 ? | | Logs | | master | | - | | check |
| 2019-05-22 19:24 | | 97 min | | Undercloud install failed. | | 655182,5 ? | | Logs | | master | | Logstash | | check |
| 2019-05-22 18:45 | | 88 min | | Undercloud install failed. | | 660710,2 ? | | Logs | | master | | Logstash | | check |
| 2019-05-22 18:45 | | 88 min | | Undercloud install failed. | | 660710,2 ? | | Logs | | master | | Logstash | | check |
| 2019-05-22 15:47 | | 101 min | | Undercloud install failed. | | 660354,2 ? | | Logs | | master | | Logstash | | check |
| 2019-05-22 14:58 | | 71 min | | Please investigate. Reason was NOT FOUND. | | 660561,2 ? | | Logs | | stable/stein | | - | | check |
| 2019-05-22 14:17 | | 101 min | | Undercloud install failed. | | 657959,6 ? | | Logs | | master | | Logstash | | check |
| 2019-05-22 13:38 | | 105 min | | Undercloud install failed. | | 660636,1 ? | | Logs | | master | | Logstash | | check |
| 2019-05-22 12:28 | | 110 min | | Please investigate. Reason was NOT FOUND. | | 660615,1 ? | | Logs | | master | | - | | check |
| 2019-05-22 12:01 | | 105 min | | Undercloud install failed. | | 660564,3 ? | | Logs | | master | | Logstash | | check |
| 2019-05-22 11:41 | | 98 min | | Undercloud install failed. | | 660555,3 ? | | Logs | | master | | Logstash | | check |
| 2019-05-22 09:07 | | 87 min | | Delorean FAIL. | | 660564,1 ? | | Logs | | master | | Logstash | | check |
| 2019-05-22 08:18 | | 87 min | | Undercloud install failed. | | 660555,2 ? | | Logs | | master | | Logstash | | check |
| 2019-05-22 07:49 | | 94 min | | Undercloud install failed. | | 660559,1 ? | | Logs | | master | | Logstash | | check |
| 2019-05-22 04:37 | | 19 min | | Network issue 'No more mirrors'. | | 657959,6 ? | | Logs | | master | | Logstash | | check |
| 2019-05-22 03:48 | | 98 min | | Undercloud install failed. | | 660508,5 ? | | Logs | | master | | Logstash | | check |
| 2019-05-22 03:48 | | 98 min | | Undercloud install failed. | | 660508,5 ? | | Logs | | master | | Logstash | | check |
| 2019-05-22 01:48 | | 77 min | | Please investigate. Reason was NOT FOUND. | | 658745,1 ? | | Logs | | stable/stein | | - | | check |
| 2019-05-22 00:01 | | 80 min | | Undercloud install failed. | | 660508,4 ? | | Logs | | master | | Logstash | | check |
| 2019-05-22 00:01 | | 80 min | | Undercloud install failed. | | 660508,4 ? | | Logs | | master | | Logstash | | check |
| 2019-05-21 23:37 | | 72 min | | Please investigate. Reason was NOT FOUND. | | 660511,1 ? | | Logs | | stable/stein | | - | | check |
| 2019-05-21 22:29 | | 93 min | | Please investigate. Reason was NOT FOUND. | | 658745,1 ? | | Logs | | stable/stein | | - | | check |
| 2019-05-21 22:18 | | 68 min | | Please investigate. Reason was NOT FOUND. | | 655182,4 ? | | Logs | | master | | - | | check |
| 2019-05-21 22:16 | | 89 min | | Undercloud install failed. | | 660495,1 ? | | Logs | | master | | Logstash | | check |
| 2019-05-21 21:21 | | 109 min | | Please investigate. Reason was NOT FOUND. | | 660167,2 ? | | Logs | | master | | - | | check |
| 2019-05-21 20:14 | | 125 min | | SUCCESS | | 658280,3 ? | | Logs | | stable/rocky | | - | | check |
| 2019-05-21 19:36 | | 82 min | | Please investigate. Reason was NOT FOUND. | | 660418,1 ? | | Logs | | stable/stein | | - | | check |
| 2019-05-21 19:21 | | 110 min | | Please investigate. Reason was NOT FOUND. | | 651732,3 ? | | Logs | | master | | - | | check |
| 2019-05-21 18:27 | | 119 min | | Please investigate. Reason was NOT FOUND. | | 634241,10 ? | | Logs | | master | | - | | check |
| 2019-05-21 17:21 | | 65 min | | Please investigate. Reason was NOT FOUND. | | 659906,10 ? | | Logs | | master | | - | | check |
| 2019-05-21 17:21 | | 65 min | | Please investigate. Reason was NOT FOUND. | | 659906,10 ? | | Logs | | master | | - | | check |
| 2019-05-21 16:52 | | 143 min | | Please investigate. Reason was NOT FOUND. | | 660335,2 ? | | Logs | | stable/stein | | - | | check |
| 2019-05-21 16:52 | | 107 min | | Please investigate. Reason was NOT FOUND. | | 660334,2 ? | | Logs | | stable/stein | | - | | check |
| 2019-05-21 16:47 | | 102 min | | SUCCESS | | 660377,1 ? | | Logs | | stable/rocky | | - | | check |
| 2019-05-21 16:30 | | 84 min | | Undercloud install failed. | | 660379,1 ? | | Logs | | master | | Logstash | | check |
| 2019-05-21 15:48 | | 97 min | | Undercloud install failed. | | 656398,11 ? | | Logs | | master | | Logstash | | check |
| 2019-05-21 15:48 | | 97 min | | Undercloud install failed. | | 656398,11 ? | | Logs | | master | | Logstash | | check |
| 2019-05-21 15:17 | | 78 min | | Undercloud install failed. | | 657959,4 ? | | Logs | | master | | Logstash | | check |
| 2019-05-21 14:36 | | 82 min | | Undercloud install failed. | | 660354,1 ? | | Logs | | master | | Logstash | | check |
| 2019-05-21 14:28 | | 21 min | | /home/zuul/containers-prepare-parameter.yaml file missing. | | 660176,5 ? | | Logs | | master | | Logstash | | check |
| 2019-05-21 13:47 | | 57 min | | Delorean FAIL. | | 658280,1 ? | | Logs | | stable/rocky | | Logstash | | check |
| 2019-05-21 13:08 | | 98 min | | Undercloud install failed. | | 660345,1 ? | | Logs | | master | | Logstash | | check |
| 2019-05-21 12:54 | | 114 min | | Please investigate. Reason was NOT FOUND. | | 660334,1 ? | | Logs | | stable/stein | | - | | check |
| 2019-05-21 12:39 | | 77 min | | Undercloud install failed. | | 659238,4 ? | | Logs | | master | | Logstash | | check |
| 2019-05-21 12:28 | | 80 min | | Undercloud install failed. | | 651786,4 ? | | Logs | | master | | Logstash | | check |
| 2019-05-21 12:02 | | 110 min | | Undercloud install failed. | | 660335,1 ? | | Logs | | stable/stein | | Logstash | | check |
| 2019-05-21 09:29 | | 78 min | | Undercloud install failed. | | 651732,3 ? | | Logs | | master | | Logstash | | check |
| 2019-05-21 02:24 | | 61 min | | Please investigate. Reason was NOT FOUND. | | 659906,9 ? | | Logs | | master | | - | | check |
| 2019-05-21 02:24 | | 61 min | | Please investigate. Reason was NOT FOUND. | | 659906,9 ? | | Logs | | master | | - | | check |
| 2019-05-21 02:02 | | 80 min | | Undercloud install failed. | | 656984,8 ? | | Logs | | master | | Logstash | | check |
| 2019-05-21 01:13 | | 78 min | | Undercloud install failed. | | 660222,1 ? | | Logs | | master | | Logstash | | check |
| 2019-05-21 00:55 | | 106 min | | Undercloud install failed. | | 660223,1 ? | | Logs | | master | | Logstash | | check |
| 2019-05-21 00:39 | | 122 min | | Please investigate. Reason was NOT FOUND. | | 660209,1 ? | | Logs | | stable/stein | | - | | check |
| 2019-05-21 00:29 | | 85 min | | Undercloud install failed. | | 660212,1 ? | | Logs | | master | | Logstash | | check |
| 2019-05-21 00:18 | | 78 min | | Undercloud install failed. | | 660221,1 ? | | Logs | | master | | Logstash | | check |
| 2019-05-21 00:12 | | 77 min | | Undercloud install failed. | | 659794,4 ? | | Logs | | master | | Logstash | | check |
| 2019-05-21 00:12 | | 19 min | | /home/zuul/containers-prepare-parameter.yaml file missing. | | 660176,4 ? | | Logs | | master | | Logstash | | check |
| 2019-05-20 23:24 | | 74 min | | Undercloud install failed. | | 660169,2 ? | | Logs | | master | | Logstash | | check |
| 2019-05-20 22:46 | | 79 min | | Undercloud install failed. | | 656984,8 ? | | Logs | | master | | Logstash | | check |
| 2019-05-20 22:26 | | 111 min | | SUCCESS | | 656416,4 ? | | Logs | | stable/rocky | | - | | check |
| 2019-05-20 21:20 | | 88 min | | Undercloud install failed. | | 660167,1 ? | | Logs | | master | | Logstash | | check |
| 2019-05-20 20:51 | | 75 min | | Undercloud install failed. | | 659144,3 ? | | Logs | | master | | Logstash | | check |
| 2019-05-20 20:46 | | 90 min | | Undercloud install failed. | | 659148,2 ? | | Logs | | master | | Logstash | | check |
| 2019-05-20 20:26 | | 71 min | | Please investigate. Reason was NOT FOUND. | | 659906,8 ? | | Logs | | master | | - | | check |
| 2019-05-20 20:26 | | 71 min | | Please investigate. Reason was NOT FOUND. | | 659906,8 ? | | Logs | | master | | - | | check |
| 2019-05-20 19:50 | | 82 min | | Undercloud install failed. | | 660156,1 ? | | Logs | | master | | Logstash | | check |
| 2019-05-20 18:56 | | 81 min | | Undercloud install failed. | | 660150,1 ? | | Logs | | master | | Logstash | | check |
| 2019-05-20 18:56 | | 81 min | | Undercloud install failed. | | 660150,1 ? | | Logs | | master | | Logstash | | check |
| 2019-05-20 18:36 | | 85 min | | Undercloud install failed. | | 653934,4 ? | | Logs | | master | | Logstash | | check |
| 2019-05-20 18:33 | | 86 min | | Undercloud install failed. | | 657919,6 ? | | Logs | | master | | Logstash | | check |
| 2019-05-20 18:13 | | 80 min | | Undercloud install failed. | | 653151,7 ? | | Logs | | master | | Logstash | | check |
| 2019-05-20 18:00 | | 102 min | | Undercloud install failed. | | 660111,1 ? | | Logs | | master | | Logstash | | check |
| 2019-05-20 16:52 | | 78 min | | Undercloud install failed. | | 653838,6 ? | | Logs | | master | | Logstash | | check |
| 2019-05-20 16:34 | | 88 min | | Undercloud install failed. | | 653843,6 ? | | Logs | | master | | Logstash | | check |
| 2019-05-20 15:49 | | 16 min | | Please investigate. Reason was NOT FOUND. | | 659906,6 ? | | Logs | | master | | - | | check |
| 2019-05-20 15:49 | | 16 min | | Please investigate. Reason was NOT FOUND. | | 659906,6 ? | | Logs | | master | | - | | check |
| 2019-05-20 15:34 | | 85 min | | Undercloud install failed. | | 659794,2 ? | | Logs | | master | | Logstash | | check |
| 2019-05-20 15:08 | | 76 min | | Please investigate. Reason was NOT FOUND. | | 659909,6 ? | | Logs | | master | | - | | check |
| 2019-05-20 14:59 | | 77 min | | Undercloud install failed. | | 643056,12 ? | | Logs | | master | | Logstash | | check |
| 2019-05-20 14:57 | | 81 min | | Undercloud install failed. | | 660100,1 ? | | Logs | | master | | Logstash | | check |
| 2019-05-20 14:21 | | 87 min | | Undercloud install failed. | | 659238,3 ? | | Logs | | master | | Logstash | | check |
| 2019-05-20 13:51 | | 127 min | | Please investigate. Reason was NOT FOUND. | | 660058,1 ? | | Logs | | stable/stein | | - | | check |
| 2019-05-20 13:50 | | 137 min | | Please investigate. Reason was NOT FOUND. | | 660093,1 ? | | Logs | | stable/stein | | - | | check |
| 2019-05-20 13:35 | | 76 min | | Undercloud install failed. | | 659817,2 ? | | Logs | | master | | Logstash | | check |
| 2019-05-20 12:31 | | 76 min | | Undercloud install failed. | | 660036,2 ? | | Logs | | master | | Logstash | | check |
| 2019-05-20 09:55 | | 11 min | | Pip install FAIL. | | 660058,1 ? | | Logs | | stable/stein | | Logstash | | check |
| 2019-05-20 09:06 | | 10 min | | Pip install FAIL. | | 653934,4 ? | | Logs | | master | | Logstash | | check |
| 2019-05-20 07:52 | | 11 min | | Pip install FAIL. | | 660036,1 ? | | Logs | | master | | Logstash | | check |
| 2019-05-20 02:15 | | 68 min | | Undercloud install failed. | | 659907,6 ? | | Logs | | master | | Logstash | | check |
| 2019-05-20 00:24 | | 18 min | | Please investigate. Reason was NOT FOUND. | | 659909,5 ? | | Logs | | master | | - | | check |
| 2019-05-19 23:55 | | 14 min | | Please investigate. Reason was NOT FOUND. | | 659906,4 ? | | Logs | | master | | - | | check |
| 2019-05-19 23:55 | | 14 min | | Please investigate. Reason was NOT FOUND. | | 659906,4 ? | | Logs | | master | | - | | check |
| 2019-05-19 22:10 | | 76 min | | Undercloud install failed. | | 659907,4 ? | | Logs | | master | | Logstash | | check |
| 2019-05-19 13:42 | | 80 min | | Undercloud install failed. | | 659907,3 ? | | Logs | | master | | Logstash | | check |
| 2019-05-19 13:14 | | 68 min | | Please investigate. Reason was NOT FOUND. | | 659909,3 ? | | Logs | | master | | - | | check |
| 2019-05-19 12:54 | | 76 min | | Undercloud install failed. | | 659925,2 ? | | Logs | | master | | Logstash | | check |
| 2019-05-19 11:40 | | 79 min | | Undercloud install failed. | | 647467,11 ? | | Logs | | master | | Logstash | | check |
| 2019-05-19 09:52 | | 77 min | | Undercloud install failed. | | 659926,2 ? | | Logs | | master | | Logstash | | check |
| 2019-05-19 09:14 | | 77 min | | Undercloud install failed. | | 659925,2 ? | | Logs | | master | | Logstash | | check |
| 2019-05-19 03:06 | | 71 min | | Undercloud install failed. | | 659906,3 ? | | Logs | | master | | Logstash | | check |
| 2019-05-19 03:06 | | 71 min | | Undercloud install failed. | | 659906,3 ? | | Logs | | master | | Logstash | | check |
| 2019-05-19 02:35 | | 73 min | | Undercloud install failed. | | 659907,2 ? | | Logs | | master | | Logstash | | check |

periodic-tripleo-ci-centos-7-multinode-1ctlr-featureset019-pike

periodic-tripleo-ci-centos-7-multinode-1ctlr-featureset019-pike

Date Length Reason Logs Logstash Pipeline
| 2019-05-25 06:18 | | 4285.0 min | | SUCCESS | | Logs | | - | | openstack-periodic-24hr |
| 2019-05-24 06:14 | | 4499.0 min | | SUCCESS | | Logs | | - | | openstack-periodic-24hr |
| 2019-05-23 06:20 | | 4525.0 min | | SUCCESS | | Logs | | - | | openstack-periodic-24hr |

tripleo-ci-centos-7-scenario012-multinode-oooq-container

tripleo-ci-centos-7-scenario012-multinode-oooq-container

Date Length Reason Patch Logs Branch Logstash Pipeline
| 2019-05-25 09:49 | | 119 min | | Please investigate. Reason was NOT FOUND. | | 661265,1 ? | | Logs | | master | | - | | check |
| 2019-05-24 18:49 | | 124 min | | Please investigate. Reason was NOT FOUND. | | 661330,2 ? | | Logs | | master | | - | | check |
| 2019-05-24 15:19 | | 122 min | | Please investigate. Reason was NOT FOUND. | | 659794,11 ? | | Logs | | master | | - | | check |
| 2019-05-24 15:16 | | 119 min | | Please investigate. Reason was NOT FOUND. | | 661265,1 ? | | Logs | | master | | - | | check |
| 2019-05-24 10:00 | | 128 min | | Please investigate. Reason was NOT FOUND. | | 656269,2 ? | | Logs | | master | | - | | check |
| 2019-05-24 00:13 | | 138 min | | Please investigate. Reason was NOT FOUND. | | 659794,10 ? | | Logs | | master | | - | | check |
| 2019-05-23 23:33 | | 137 min | | Please investigate. Reason was NOT FOUND. | | 661109,1 ? | | Logs | | master | | - | | check |
| 2019-05-23 21:34 | | 141 min | | Please investigate. Reason was NOT FOUND. | | 661049,1 ? | | Logs | | master | | - | | check |
| 2019-05-23 20:29 | | 137 min | | Please investigate. Reason was NOT FOUND. | | 661034,1 ? | | Logs | | master | | - | | check |
| 2019-05-23 16:43 | | 132 min | | Please investigate. Reason was NOT FOUND. | | 657959,7 ? | | Logs | | master | | - | | check |
| 2019-05-23 14:47 | | 134 min | | Please investigate. Reason was NOT FOUND. | | 660176,6 ? | | Logs | | master | | - | | check |
| 2019-05-23 04:41 | | 132 min | | Please investigate. Reason was NOT FOUND. | | 659794,6 ? | | Logs | | master | | - | | check |
| 2019-05-22 15:47 | | 137 min | | Please investigate. Reason was NOT FOUND. | | 660354,2 ? | | Logs | | master | | - | | check |
| 2019-05-22 14:17 | | 126 min | | Please investigate. Reason was NOT FOUND. | | 657959,6 ? | | Logs | | master | | - | | check |
| 2019-05-22 12:28 | | 140 min | | Please investigate. Reason was NOT FOUND. | | 660615,1 ? | | Logs | | master | | - | | check |
| 2019-05-22 11:41 | | 127 min | | Please investigate. Reason was NOT FOUND. | | 660555,3 ? | | Logs | | master | | - | | check |
| 2019-05-22 08:18 | | 130 min | | Please investigate. Reason was NOT FOUND. | | 660555,2 ? | | Logs | | master | | - | | check |
| 2019-05-22 04:37 | | 135 min | | Please investigate. Reason was NOT FOUND. | | 657959,6 ? | | Logs | | master | | - | | check |
| 2019-05-21 16:30 | | 144 min | | Please investigate. Reason was NOT FOUND. | | 660379,1 ? | | Logs | | master | | - | | check |
| 2019-05-21 15:17 | | 135 min | | Please investigate. Reason was NOT FOUND. | | 657959,4 ? | | Logs | | master | | - | | check |
| 2019-05-21 14:36 | | 132 min | | Please investigate. Reason was NOT FOUND. | | 660354,1 ? | | Logs | | master | | - | | check |
| 2019-05-21 14:28 | | 148 min | | Please investigate. Reason was NOT FOUND. | | 660176,5 ? | | Logs | | master | | - | | check |
| 2019-05-21 00:12 | | 124 min | | Please investigate. Reason was NOT FOUND. | | 659794,4 ? | | Logs | | master | | - | | check |
| 2019-05-21 00:12 | | 139 min | | Please investigate. Reason was NOT FOUND. | | 660176,4 ? | | Logs | | master | | - | | check |
| 2019-05-20 15:34 | | 150 min | | Please investigate. Reason was NOT FOUND. | | 659794,2 ? | | Logs | | master | | - | | check |
| 2019-05-20 15:08 | | 142 min | | Please investigate. Reason was NOT FOUND. | | 659909,6 ? | | Logs | | master | | - | | check |
| 2019-05-20 14:57 | | 132 min | | Please investigate. Reason was NOT FOUND. | | 660100,1 ? | | Logs | | master | | - | | check |
| 2019-05-20 12:31 | | 140 min | | Please investigate. Reason was NOT FOUND. | | 660036,2 ? | | Logs | | master | | - | | check |
| 2019-05-20 07:52 | | 7 min | | Pip install FAIL. | | 660036,1 ? | | Logs | | master | | Logstash | | check |
| 2019-05-20 02:15 | | 130 min | | Please investigate. Reason was NOT FOUND. | | 659907,6 ? | | Logs | | master | | - | | check |
| 2019-05-20 00:24 | | 20 min | | Please investigate. Reason was NOT FOUND. | | 659909,5 ? | | Logs | | master | | - | | check |
| 2019-05-19 22:10 | | 120 min | | Please investigate. Reason was NOT FOUND. | | 659907,4 ? | | Logs | | master | | - | | check |
| 2019-05-19 13:42 | | 122 min | | Please investigate. Reason was NOT FOUND. | | 659907,3 ? | | Logs | | master | | - | | check |
| 2019-05-19 13:14 | | 28 min | | Please investigate. Reason was NOT FOUND. | | 659909,3 ? | | Logs | | master | | - | | check |
| 2019-05-19 02:35 | | 85 min | | Overcloud deploy failed. Overcloud stack: FAILED. | | 659907,2 ? | | Logs | | master | | Logstash | | check |

periodic-tripleo-ci-centos-7-multinode-1ctlr-featureset018-pike

periodic-tripleo-ci-centos-7-multinode-1ctlr-featureset018-pike

Date Length Reason Logs Logstash Pipeline
| 2019-05-25 06:21 | | 5261.0 min | | SUCCESS | | Logs | | - | | openstack-periodic-24hr |
| 2019-05-24 06:06 | | 4054.0 min | | SUCCESS | | Logs | | - | | openstack-periodic-24hr |
| 2019-05-23 06:14 | | 4081.0 min | | SUCCESS | | Logs | | - | | openstack-periodic-24hr |

tripleo-ci-centos-7-containers-multinode

tripleo-ci-centos-7-containers-multinode

Date Length Reason Patch Logs Branch Logstash Pipeline
| 2019-05-26 00:54 | | 122 min | | SUCCESS | | 660995,5 ? | | Logs | | master | | - | | check |
| 2019-05-26 00:45 | | 59 min | | Undercloud install failed. | | 661267,4 ? | | Logs | | master | | Logstash | | check |
| 2019-05-26 00:39 | | 113 min | | SUCCESS | | 661001,4 ? | | Logs | | master | | - | | check |
| 2019-05-25 19:36 | | 130 min | | SUCCESS | | 661014,1 ? | | Logs | | master | | - | | gate |
| 2019-05-25 14:33 | | 40 min | | Undercloud install failed. | | 661267,4 ? | | Logs | | master | | Logstash | | check |
| 2019-05-25 09:49 | | 121 min | | SUCCESS | | 661265,1 ? | | Logs | | master | | - | | check |
| 2019-05-25 09:13 | | 120 min | | SUCCESS | | 661434,3 ? | | Logs | | master | | - | | check |
| 2019-05-25 05:24 | | 125 min | | SUCCESS | | 661361,4 ? | | Logs | | master | | - | | check |
| 2019-05-25 03:52 | | 127 min | | SUCCESS | | 660850,1 ? | | Logs | | stable/queens | | - | | gate |
| 2019-05-25 02:22 |